BDBM50376641 CHEMBL261287
SMILES CCOC(=O)CCNC(=O)n1oc(=O)c(c1-c1ccncc1)-c1ccc(F)cc1
InChI Key InChIKey=VOPOWBXKARSLGZ-UHFFFAOYSA-N
Data  1 IC50
  Tab Delimited (TSV)   2D SDfile   Computed 3D by Vconf -m prep SDfile
Find this compound or compounds like it in BindingDB:
Activity Spreadsheet -- Enzyme Inhibition Constant Data from BindingDB
Found 1 hit for monomerid = 50376641
TargetMitogen-activated protein kinase 14(Homo sapiens (Human))
Eberhard Karls University Of Tuebingen
Curated by ChEMBL
LigandPNGBDBM50376641(CHEMBL261287)
Affinity DataIC50:  970nM. Assay description: Inhibition of p38-alpha MAPK
In DepthDetails ArticlePubMed