BDBM50377062 CHEMBL430214
SMILES CC1CCN(CC1)c1cc(ccc1NC(=O)c1ccc(o1)C#N)C#CCN(C)S(C)(=O)=O
InChI Key InChIKey=GOCXYFFOSGSRSB-UHFFFAOYSA-N
Data  1 IC50
  Tab Delimited (TSV)   2D SDfile   Computed 3D by Vconf -m prep SDfile
Find this compound or compounds like it in BindingDB:
Activity Spreadsheet -- Enzyme Inhibition Constant Data from BindingDB
Found 1 hit for monomerid = 50377062
TargetMacrophage colony-stimulating factor 1 receptor(Homo sapiens (Human))
Johnson & Johnson Pharmaceutical Research & Development
Curated by ChEMBL
LigandPNGBDBM50377062(CHEMBL430214)
Affinity DataIC50:  16nM. Assay description: Inhibition of FMS
In DepthDetails ArticlePubMed