BDBM50377063 CHEMBL261699
SMILES CC1CCN(CC1)c1cc(\C=C\C(O)=O)ccc1NC(=O)c1ccc(o1)C#N
InChI Key InChIKey=HHKFUJAAUZUYJW-XVNBXDOJSA-N
Data  1 IC50
  Tab Delimited (TSV)   2D SDfile   Computed 3D by Vconf -m prep SDfile
Find this compound or compounds like it in BindingDB:
Activity Spreadsheet -- Enzyme Inhibition Constant Data from BindingDB
Found 1 hit for monomerid = 50377063
TargetMacrophage colony-stimulating factor 1 receptor(Homo sapiens (Human))
Johnson & Johnson Pharmaceutical Research & Development
Curated by ChEMBL
LigandPNGBDBM50377063(CHEMBL261699)
Affinity DataIC50:  2nM. Assay description: Inhibition of FMS
In DepthDetails ArticlePubMed