BDBM50379282 GYMNASTERKOREAYNE E
SMILES C[C@H](O)[C@H](O)C#CC#C[C@@H](O)\C=C\CCCCCC=C
InChI Key InChIKey=BEZRAMBFCSSHHE-MTQUPGJJSA-N
Data  1 IC50
  Tab Delimited (TSV)   2D SDfile   Computed 3D by Vconf -m prep SDfile
Find this compound or compounds like it in BindingDB:
Activity Spreadsheet -- Enzyme Inhibition Constant Data from BindingDB
Found 1 hit for monomerid = 50379282
TargetAldo-keto reductase family 1 member B1(Rattus norvegicus)
Korean Institute Of Oriental Medicine (Kiom)
Curated by ChEMBL
LigandPNGBDBM50379282(GYMNASTERKOREAYNE E)
Affinity DataIC50: >3.00E+4nM. Assay description: Inhibition of Sprague-Dawley rat lens aldose reductase
Ligand InfoPC cidPC sid
In DepthDetails ArticlePubMed