BDBM50380971 CHEMBL2016927
SMILES Clc1ccc2[nH]c(=O)c(cc2c1)-c1nc2CCN(Cc2[nH]1)C(=O)Cc1ccncc1
InChI Key InChIKey=NMRHMZMYGUDRJD-UHFFFAOYSA-N
Data  1 IC50
  Tab Delimited (TSV)   2D SDfile   Computed 3D by Vconf -m prep SDfile
Find this compound or compounds like it in BindingDB:
Activity Spreadsheet -- Enzyme Inhibition Constant Data from BindingDB
Found 1 hit for monomerid = 50380971
TargetVascular endothelial growth factor receptor 2(Homo sapiens (Human))
Korea Research Institute Of Chemical Technology
Curated by ChEMBL
LigandPNGBDBM50380971(CHEMBL2016927)
Affinity DataIC50:  0.5nM. Assay description: Inhibition of recombinant VEGFR-2 kinase domain by homogeneous time-resolved fluorescence assay
In DepthDetails ArticlePubMed