BDBM50383787 CHEMBL2030806
SMILES CNc1cccc(CCOc2ccc(C[C@H](NC(=O)c3c(C)cc(C)cc3C)C(O)=O)cc2)n1
InChI Key InChIKey=CJYMQDSGVRJJGX-QHCPKHFHSA-N
Data  5 IC50
  Tab Delimited (TSV)   2D SDfile   Computed 3D by Vconf -m prep SDfile
Find this compound or compounds like it in BindingDB:
Activity Spreadsheet -- Enzyme Inhibition Constant Data from BindingDB
Found 5 hits for monomerid = 50383787
TargetIntegrin alpha-5/beta-1(Homo sapiens (Human))
Astrazeneca
Curated by ChEMBL
LigandPNGBDBM50383787(CHEMBL2030806)
Affinity DataIC50:  22nM. Assay description: Antagonist activity at integrin alpha5beta1 in human K562 cells assessed as inhibition of cell adhesion
In DepthDetails ArticlePubMed
TargetIntegrin alpha-5/beta-1(Homo sapiens (Human))
Astrazeneca
Curated by ChEMBL
LigandPNGBDBM50383787(CHEMBL2030806)
Affinity DataIC50:  1nM. Assay description: Binding affinity to integrin alpha5beta1
In DepthDetails ArticlePubMed
TargetIntegrin alpha-V/beta-3(Homo sapiens (Human))
Astrazeneca
Curated by ChEMBL
LigandPNGBDBM50383787(CHEMBL2030806)
Affinity DataIC50:  370nM. Assay description: Antagonist activity at integrin alphaVbeta3 in human A375M cells assessed as cell adhesion to fibrinogen in presence of Mg2+
In DepthDetails ArticlePubMed
TargetIntegrin alpha-5/beta-1(Homo sapiens (Human))
Astrazeneca
Curated by ChEMBL
LigandPNGBDBM50383787(CHEMBL2030806)
Affinity DataIC50:  1.50E+3nM. Assay description: Antagonist activity at integrin alpha5beta1 in human K562 cells assessed as inhibition of cell adhesion in presence of human serum albumin
In DepthDetails ArticlePubMed
TargetIntegrin alpha-5/beta-1(Homo sapiens (Human))
Astrazeneca
Curated by ChEMBL
LigandPNGBDBM50383787(CHEMBL2030806)
Affinity DataIC50:  57nM. Assay description: Antagonist activity at integrin alpha5beta1 in human A375M cells assessed as inhibition of cell adhesion in presence of Mg2+ and MK-0429
In DepthDetails ArticlePubMed