BDBM50383973 CHEMBL2032147
SMILES NC(=O)CCNC(=O)NC(=O)[C@@H]1CCCN1C(=O)[C@H](CC1CCCC1)CN(O)C=O
InChI Key InChIKey=QFWSNBCYIILFGI-CABCVRRESA-N
Data  2 IC50
  Tab Delimited (TSV)   2D SDfile   Computed 3D by Vconf -m prep SDfile
Find this compound or compounds like it in BindingDB:
Activity Spreadsheet -- Enzyme Inhibition Constant Data from BindingDB
Found 2 hits for monomerid = 50383973
TargetPeptide deformylase(Streptococcus pneumoniae serotype 4 (strain ATCC B...)
Glaxosmithkline
Curated by ChEMBL
LigandPNGBDBM50383973(CHEMBL2032147)
Affinity DataIC50:  0.720nM. Assay description: Inhibition of Streptococcus pneumoniae PDF assessed as formate release from fMAS peptide substrate after 20 mins by formate dehydrogenase coupled ass...
In DepthDetails ArticlePubMed
TargetPeptide deformylase(Staphylococcus aureus)
Glaxosmithkline
Curated by ChEMBL
LigandPNGBDBM50383973(CHEMBL2032147)
Affinity DataIC50:  3.30nM. Assay description: Inhibition of Staphylococcus aureus PDF assessed as formate release from fMAS peptide substrate after 20 mins by formate dehydrogenase coupled assay
In DepthDetails ArticlePubMed