BDBM50384038 CHEMBL2032155
SMILES Nc1ncc(cc1-c1nc2cccc(-c3ccccn3)c2o1)-c1cnn(c1)C1CCNCC1
InChI Key InChIKey=OPWIMESOOZSXGC-UHFFFAOYSA-N
Data  2 IC50
  Tab Delimited (TSV)   2D SDfile   Computed 3D by Vconf -m prep SDfile
Find this compound or compounds like it in BindingDB:
Activity Spreadsheet -- Enzyme Inhibition Constant Data from BindingDB
Found 2 hits for monomerid = 50384038
TargetReceptor-type tyrosine-protein kinase FLT3(Homo sapiens (Human))
Korea Research Institute Of Chemical Technology
Curated by ChEMBL
LigandPNGBDBM50384038(CHEMBL2032155)
Affinity DataIC50:  0.600nM. Assay description: Inhibition of recombinant FLT3 by time resolved-fluorescence resonance energy transfer analysis
In DepthDetails ArticlePubMed
TargetHepatocyte growth factor receptor(Homo sapiens (Human))
Korea Research Institute Of Chemical Technology
Curated by ChEMBL
LigandPNGBDBM50384038(CHEMBL2032155)
Affinity DataIC50:  1.60nM. Assay description: Inhibition of recombinant c-Met by time resolved-fluorescence resonance energy transfer analysis
In DepthDetails ArticlePubMed