BDBM50385417 CHEMBL2036588
SMILES Fc1cccc(Nc2nnc(o2)C(=O)Nc2ccc(nc2)N2CCOCC2)c1
InChI Key InChIKey=WFDORLFOPZGMLU-UHFFFAOYSA-N
Data  1 IC50
  Tab Delimited (TSV)   2D SDfile   Computed 3D by Vconf -m prep SDfile
Find this compound or compounds like it in BindingDB:
Activity Spreadsheet -- Enzyme Inhibition Constant Data from BindingDB
Found 1 hit for monomerid = 50385417
TargetDiacylglycerol O-acyltransferase 1(Homo sapiens (Human))
Astrazeneca
Curated by ChEMBL
LigandPNGBDBM50385417(CHEMBL2036588)
Affinity DataIC50:  150nM. Assay description: Inhibition of human recombinant DGAT1 expressed in baculovirus infected insect sf9 cells using [14C] oleoyl coenzyme A after 30 mins by scintillation...
In DepthDetails ArticlePubMed