BDBM50386548 CHEMBL2048228
SMILES CCCN1CCC(CC1)c1ccc(cc1)C(F)(F)F
InChI Key InChIKey=FFRGZBOVYKMGFL-UHFFFAOYSA-N
Data  2 KI
  Tab Delimited (TSV)   2D SDfile   Computed 3D by Vconf -m prep SDfile
Find this compound or compounds like it in BindingDB:
Activity Spreadsheet -- Enzyme Inhibition Constant Data from BindingDB
Found 2 hits for monomerid = 50386548
TargetAmine oxidase [flavin-containing] A(Rattus norvegicus (rat))
Neurosearch Sweden
Curated by ChEMBL
LigandPNGBDBM50386548(CHEMBL2048228)
Affinity DataKi:  6.92E+3nM. Assay description: Displacement of [3H]-Ro 41-1049 from MAO-A receptor in rat cerebral cortex
In DepthDetails ArticlePubMed
TargetAmine oxidase [flavin-containing] B(Rattus norvegicus (rat))
Neurosearch Sweden
Curated by ChEMBL
LigandPNGBDBM50386548(CHEMBL2048228)
Affinity DataKi:  1.29E+4nM. Assay description: Displacement of [3H]-Ro 16-6491 from MAO-B receptor in rat cerebral cortex
In DepthDetails ArticlePubMed