BDBM50386787 CHEMBL2047156
SMILES Cc1cc(OC2CCS(=O)(=O)CC2)cc(C)c1-c1cccc(COc2ccc3[C@@H](CC(O)=O)COc3c2)c1
InChI Key InChIKey=AQQQCXSXMJJHOU-QHCPKHFHSA-N
Data  2 KI  1 EC50
  Tab Delimited (TSV)   2D SDfile   Computed 3D by Vconf -m prep SDfile
Find this compound or compounds like it in BindingDB:
Activity Spreadsheet -- Enzyme Inhibition Constant Data from BindingDB
Found 3 hits for monomerid = 50386787
TargetFree fatty acid receptor 1(Homo sapiens (Human))
Takeda Pharmaceutical
Curated by ChEMBL
LigandPNGBDBM50386787(CHEMBL2047156)
Affinity DataKi:  300nM. Assay description: Displacement of 3-[4-({2',6'-dimethyl-6-[(4-[3H])-phenylmethoxy]biphenyl-3-yl}methoxy)phenyl]propanoic acid from human GPR40 expressed in CHO cells a...
In DepthDetails ArticlePubMed
TargetFree fatty acid receptor 1(Rattus norvegicus)
Takeda Pharmaceutical
Curated by ChEMBL
LigandPNGBDBM50386787(CHEMBL2047156)
Affinity DataKi:  510nM. Assay description: Displacement of 3-[4-({2',6'-dimethyl-6-[(4-[3H])-phenylmethoxy]biphenyl-3-yl}methoxy)phenyl]propanoic acid from rat GPR40 expressed in CHO cells aft...
In DepthDetails ArticlePubMed
TargetFree fatty acid receptor 1(Homo sapiens (Human))
Takeda Pharmaceutical
Curated by ChEMBL
LigandPNGBDBM50386787(CHEMBL2047156)
Affinity DataEC50:  290nM. Assay description: Agonist activity at human GP40 receptor expressed in CHO cells assessed as increase in intracellular calcium level for 90 secs by FLIPR assay in the ...
In DepthDetails ArticlePubMed