BDBM50386912 CHEMBL2048658
SMILES CCS(=O)(=O)Nc1ccc(CCNC(=O)c2ccnc3nc([nH]c23)-c2ccccc2)cc1
InChI Key InChIKey=JLMLOAXSQPVMKQ-UHFFFAOYSA-N
Data  1 IC50  1 EC50
  Tab Delimited (TSV)   2D SDfile   Computed 3D by Vconf -m prep SDfile
Find this compound or compounds like it in BindingDB:
Activity Spreadsheet -- Enzyme Inhibition Constant Data from BindingDB
Found 1 hit for monomerid = 50386912
TargetGlycogen synthase kinase-3 beta(Homo sapiens (Human))
Crystalgenomics
Curated by ChEMBL
LigandPNGBDBM50386912(CHEMBL2048658)
Affinity DataIC50:  14nM. Assay description: Inhibition of human GSK3beta using phospho-CREB as substrate by beta counting method
In DepthDetails ArticlePubMed