BDBM50388062 CHEMBL2059472
SMILES Cc1cc(N=NCc2ccc(cc2)C#N)c2cc3OCOc3cc2n1
InChI Key InChIKey=CTSKMSPOYULDLC-UHFFFAOYSA-N
Data  1 IC50
  Tab Delimited (TSV)   2D SDfile   Computed 3D by Vconf -m prep SDfile
Find this compound or compounds like it in BindingDB:
Activity Spreadsheet -- Enzyme Inhibition Constant Data from BindingDB
Found 1 hit for monomerid = 50388062
TargetSubtilisin-like protease 1(Plasmodium falciparum)
University Of Siena
Curated by ChEMBL
LigandPNGBDBM50388062(CHEMBL2059472)
Affinity DataIC50:  4.00E+4nM. Assay description: Inhibition of Plasmodium falciparum SUB1 by fluorimetric assay
In DepthDetails ArticlePubMed