BDBM50388335 CHEMBL2059503
SMILES CC(C)CCC[C@@H](C)[C@H]1CC[C@H]2[C@@H]3CC[C@H]4C[C@H](CC[C@]4(C)[C@H]3CC[C@]12C)O[C@@H]1O[C@H](COS([O-])(=O)=O)[C@@H](O[C@H]2O[C@H](COS([O-])(=O)=O)[C@@H](O[C@H]3O[C@H](COS([O-])(=O)=O)[C@@H](OS([O-])(=O)=O)[C@H](OS([O-])(=O)=O)[C@H]3OS([O-])(=O)=O)[C@H](OS([O-])(=O)=O)[C@H]2OS([O-])(=O)=O)[C@H](OS([O-])(=O)=O)[C@H]1OS([O-])(=O)=O
InChI Key InChIKey=VENGQIUBROEMGG-BMBPBTAQSA-D
Data  1 KI  2 Kd
  Tab Delimited (TSV)   2D SDfile   Computed 3D by Vconf -m prep SDfile
Find this compound or compounds like it in BindingDB:
Activity Spreadsheet -- Enzyme Inhibition Constant Data from BindingDB
Found 3 hits for monomerid = 50388335
TargetHeparanase(Homo sapiens (Human))
Progen Pharmaceuticals
Curated by ChEMBL
LigandPNGBDBM50388335(CHEMBL2059503)
Affinity DataKi:  9.10nM. Assay description: Inhibition of human recombinant heparanase after 2 to 24 hrs by WST1 dye based fondaparinux assay
In DepthDetails ArticlePubMed
TargetFibroblast growth factor 1(Homo sapiens (Human))
Progen Pharmaceuticals
Curated by ChEMBL
LigandPNGBDBM50388335(CHEMBL2059503)
Affinity DataKd:  24.8nM. Assay description: Binding affinity to FGF-1 by surface plasmon resonance assay
In DepthDetails ArticlePubMed
TargetFibroblast growth factor 2(Homo sapiens (Human))
Progen Pharmaceuticals
Curated by ChEMBL
LigandPNGBDBM50388335(CHEMBL2059503)
Affinity DataKd:  547nM. Assay description: Binding affinity to FGF-2 by surface plasmon resonance assay
In DepthDetails ArticlePubMed