BDBM50388836 CHEMBL2062927
SMILES CC(=O)Nc1ccc2c(c1)C(CCS2(=O)=O)=NNC(N)=S
InChI Key InChIKey=WPPGBKDFVUHVFE-UHFFFAOYSA-N
Data  2 IC50
  Tab Delimited (TSV)   2D SDfile   Computed 3D by Vconf -m prep SDfile
Find this compound or compounds like it in BindingDB:
Activity Spreadsheet -- Enzyme Inhibition Constant Data from BindingDB
Found 2 hits for monomerid = 50388836
TargetProcathepsin L(Homo sapiens (Human))
TBA
Curated by ChEMBL
LigandPNGBDBM50388836(CHEMBL2062927)
Affinity DataIC50: >1.00E+4nM. Assay description: Inhibition of human liver cathepsin L using Z-R-R-AMC as substrate preincubated with compound for 5 mins measured after 20 mins by fluorescence analy...
In DepthDetails ArticlePubMed
TargetCathepsin B(Homo sapiens (Human))
TBA
Curated by ChEMBL
LigandPNGBDBM50388836(CHEMBL2062927)
Affinity DataIC50: >1.00E+4nM. Assay description: Inhibition of human liver cathepsin B using Z-R-R-AMC as substrate preincubated with compound for 5 mins measured after 20 mins by fluorescence analy...
In DepthDetails ArticlePubMed