BDBM50389938 CHEMBL2071076
SMILES Clc1ccc(CCNC(=O)c2cc3cc(Cl)ccc3[nH]2)cc1
InChI Key InChIKey=MHZYZWDNQXPCRN-UHFFFAOYSA-N
Data  1 IC50  1 EC50
  Tab Delimited (TSV)   2D SDfile   Computed 3D by Vconf -m prep SDfile
Find this compound or compounds like it in BindingDB:
Activity Spreadsheet -- Enzyme Inhibition Constant Data from BindingDB
Found 2 hits for monomerid = 50389938
TargetCannabinoid receptor 2(Homo sapiens (Human))
Sapienza University Of Rome
Curated by ChEMBL
LigandPNGBDBM50389938(CHEMBL2071076)
Affinity DataIC50: >1.00E+4nM. Assay description: Allosteric modulation of human recombinant CB2 receptor expressed in HEK293 cells assessed as inhibition of [3H]CP55940 binding
In DepthDetails ArticlePubMed
TargetCannabinoid receptor 1(Homo sapiens (Human))
Sapienza University Of Rome
Curated by ChEMBL
LigandPNGBDBM50389938(CHEMBL2071076)
Affinity DataEC50: >1.00E+4nM. Assay description: Allosteric modulation of human recombinant CB1 receptor expressed in HEK293 cells assessed as stimulation of [3H]CP55940 binding
In DepthDetails ArticlePubMed