BDBM50391608 CHEMBL2147921
SMILES CN1CC[C@]23Cc4nc5ccc(cc5cc4C[C@@]2(O)[C@H]1Cc1ccc(O)cc31)C(F)(F)F
InChI Key InChIKey=MZTUFRFSCKUHIP-WXFUMESZSA-N
Data  3 KI
  Tab Delimited (TSV)   2D SDfile   Computed 3D by Vconf -m prep SDfile
Find this compound or compounds like it in BindingDB:
Activity Spreadsheet -- Enzyme Inhibition Constant Data from BindingDB
Found 3 hits for monomerid = 50391608
TargetDelta-type opioid receptor(MOUSE)
Kitasato University
Curated by ChEMBL
LigandPNGBDBM50391608(CHEMBL2147921)
Affinity DataKi:  0.923nM. Assay description: Displacement of [3H]DPDPE from delta opioid receptor in mouse whole brain without cerebellum
In DepthDetails ArticlePubMed
TargetMu-type opioid receptor(MOUSE)
Kitasato University
Curated by ChEMBL
LigandPNGBDBM50391608(CHEMBL2147921)
Affinity DataKi:  52.3nM. Assay description: Displacement of [3H]DAMGO from mu opioid receptor in mouse whole brain without cerebellum
In DepthDetails ArticlePubMed
TargetKappa-type opioid receptor(Cavia porcellus (domestic guinea pig))
Kitasato University
Curated by ChEMBL
LigandPNGBDBM50391608(CHEMBL2147921)
Affinity DataKi:  97.4nM. Assay description: Displacement of [3H]U-69,593 from kappa opioid receptor in guinea pig cerebellum
In DepthDetails ArticlePubMed