BDBM50391920 CHEMBL2147562
SMILES C[C@]12Cc3cnn(c3C=C1CC[C@@]2(O)CCc1ccccc1C(N)=O)-c1ccc(F)cc1
InChI Key InChIKey=OFTMUCFQUMDPJG-UIOOFZCWSA-N
Data  1 KI
  Tab Delimited (TSV)   2D SDfile   Computed 3D by Vconf -m prep SDfile
Find this compound or compounds like it in BindingDB:
Activity Spreadsheet -- Enzyme Inhibition Constant Data from BindingDB
Found 1 hit for monomerid = 50391920
TargetGlucocorticoid receptor(Homo sapiens (Human))
Merck Research Laboratories
Curated by ChEMBL
LigandPNGBDBM50391920(CHEMBL2147562)
Affinity DataKi:  2nM. Assay description: Displacement of [3H]-dexamethasone from human full length GR expressed in insect Sf21 cells
In DepthDetails ArticlePubMed