BDBM50394455 CHEMBL2159654
SMILES O=C(NCCc1c[nH]c2ccccc12)c1ccc(OCCCCOc2ccc(cc2)C(=O)c2ccccc2)cc1
InChI Key InChIKey=BMEKCNOLGJBWNB-UHFFFAOYSA-N
Data  1 KI
  Tab Delimited (TSV)   2D SDfile   Computed 3D by Vconf -m prep SDfile
Find this compound or compounds like it in BindingDB:
Activity Spreadsheet -- Enzyme Inhibition Constant Data from BindingDB
Found 1 hit for monomerid = 50394455
TargetAcetylcholinesterase(Homo sapiens (Human))
Central China Normal University
Curated by ChEMBL
LigandPNGBDBM50394455(CHEMBL2159654)
Affinity DataKi: >1.00E+4nM. Assay description: Inhibition of human recombinant AChE using acetylthiocholine as substrate
In DepthDetails ArticlePubMed