BDBM50395408 CHEMBL2165054
SMILES CO[C@H]1CN(CCn2c3cc(ccc3ccc2=O)C#N)CC[C@H]1NCc1cc2OCCOc2cn1
InChI Key InChIKey=XMIYZMBRDBBHKC-BWKNWUBXSA-N
Data  1 IC50
  Tab Delimited (TSV)   2D SDfile   Computed 3D by Vconf -m prep SDfile
Find this compound or compounds like it in BindingDB:
Activity Spreadsheet -- Enzyme Inhibition Constant Data from BindingDB
Found 1 hit for monomerid = 50395408
TargetPotassium voltage-gated channel subfamily H member 2(Homo sapiens (Human))
Astrazeneca
Curated by ChEMBL
LigandPNGBDBM50395408(CHEMBL2165054)
Affinity DataIC50:  1.74E+5nM. Assay description: Inhibition of human ERG by Ionworks assay
In DepthDetails ArticlePubMed