BDBM50395411 CHEMBL2164746
SMILES COc1ccc2ncc(=O)n(CCN3CC[C@H](NCc4ccc5OCC(=O)Nc5n4)[C@H](O)C3)c2c1
InChI Key InChIKey=JSYFJFPXKDQANW-AZUAARDMSA-N
Data  1 IC50
  Tab Delimited (TSV)   2D SDfile   Computed 3D by Vconf -m prep SDfile
Find this compound or compounds like it in BindingDB:
Activity Spreadsheet -- Enzyme Inhibition Constant Data from BindingDB
Found 1 hit for monomerid = 50395411
TargetPotassium voltage-gated channel subfamily H member 2(Homo sapiens (Human))
Astrazeneca
Curated by ChEMBL
LigandPNGBDBM50395411(CHEMBL2164746)
Affinity DataIC50:  1.72E+5nM. Assay description: Inhibition of human ERG by Ionworks assay
In DepthDetails ArticlePubMed