BDBM50395419 CHEMBL2165069
SMILES COc1ccc2ncc(=O)n(CCN3CC[C@H](NCc4cc5OCCOc5cn4)[C@@H](F)C3)c2c1
InChI Key InChIKey=ZGGXASXXNNQBCO-OALUTQOASA-N
Data  1 IC50
  Tab Delimited (TSV)   2D SDfile   Computed 3D by Vconf -m prep SDfile
Find this compound or compounds like it in BindingDB:
Activity Spreadsheet -- Enzyme Inhibition Constant Data from BindingDB
Found 1 hit for monomerid = 50395419
TargetPotassium voltage-gated channel subfamily H member 2(Homo sapiens (Human))
Astrazeneca
Curated by ChEMBL
LigandPNGBDBM50395419(CHEMBL2165069)
Affinity DataIC50:  7.50E+4nM. Assay description: Inhibition of human ERG by Ionworks assay
In DepthDetails ArticlePubMed