BDBM50395560 CHEMBL2165122
SMILES FC(F)(F)c1ccccc1N1CCN(CCCCOc2ccc3CCC(=O)Nc3c2)CC1
InChI Key InChIKey=NXHZOGJHNYRAGN-UHFFFAOYSA-N
Data  1 KI  2 EC50
  Tab Delimited (TSV)   2D SDfile   Computed 3D by Vconf -m prep SDfile
Find this compound or compounds like it in BindingDB:
Activity Spreadsheet -- Enzyme Inhibition Constant Data from BindingDB
Found 3 hits for monomerid = 50395560
TargetD(2) dopamine receptor(Homo sapiens (Human))
University Of North Carolina At Chapel Hill
Curated by ChEMBL
LigandPNGBDBM50395560(CHEMBL2165122)
Affinity DataKi:  4.20nM. Assay description: Displacement of [3H]N-methylspiperone from human D2L receptor expressed in CHO cells after 1.5 hrs by microbeta counting method
In DepthDetails ArticlePubMed
TargetD(2) dopamine receptor(Homo sapiens (Human))
University Of North Carolina At Chapel Hill
Curated by ChEMBL
LigandPNGBDBM50395560(CHEMBL2165122)
Affinity DataEC50:  25nM. Assay description: Agonist activity at human D2L receptor expressed in HEK293T cells coexpressing Gi subunit assessed as inhibition of isoproterenol-stimulated cAMP pro...
In DepthDetails ArticlePubMed
TargetD(2) dopamine receptor(Homo sapiens (Human))
University Of North Carolina At Chapel Hill
Curated by ChEMBL
LigandPNGBDBM50395560(CHEMBL2165122)
Affinity DataEC50:  2.5nM. Assay description: Agonist activity at D2L receptor in human HTLA cells assessed as beta arrestin recruitment at 6 uM after 18 hrs by luminescence assay
In DepthDetails ArticlePubMed