BDBM50395579 CHEMBL2165136::UNC10099991::US9156822, 36
SMILES Clc1cccc(N2CCN(CCCCOc3ccc4scnc4c3)CC2)c1Cl
InChI Key InChIKey=JBKITGSPOFFGJB-UHFFFAOYSA-N
Data  2 KI  2 EC50
  Tab Delimited (TSV)   2D SDfile   Computed 3D by Vconf -m prep SDfile
Find this compound or compounds like it in BindingDB:
Activity Spreadsheet -- Enzyme Inhibition Constant Data from BindingDB
Found 4 hits for monomerid = 50395579
TargetD(2) dopamine receptor(Homo sapiens (Human))
University Of North Carolina At Chapel Hill
Curated by ChEMBL
LigandPNGBDBM50395579(CHEMBL2165136 | UNC10099991 | US9156822, 36)
Affinity DataKi:  17nM. Assay description: Displacement of [3H]N-methylspiperone from human D2L receptor expressed in CHO cells after 1.5 hrs by microbeta counting method
In DepthDetails ArticlePubMed
TargetD(2) dopamine receptor(Homo sapiens (Human))
University Of North Carolina At Chapel Hill
Curated by ChEMBL
LigandPNGBDBM50395579(CHEMBL2165136 | UNC10099991 | US9156822, 36)
Affinity DataKi:  17nMpH: 7.4Assay Description:Membranes prepared as above were resuspended to 1 ug protein/ul (measured by Bradford assay using BSA as standard), and 50 ul were added to each well...
In DepthDetails US Patent
TargetD(2) dopamine receptor(Homo sapiens (Human))
University Of North Carolina At Chapel Hill
Curated by ChEMBL
LigandPNGBDBM50395579(CHEMBL2165136 | UNC10099991 | US9156822, 36)
Affinity DataEC50:  63nM. Assay description: Partial agonist activity at D2L receptor in human HTLA cells assessed as beta arrestin recruitment at 6 uM after 18 hrs by luminescence assay
In DepthDetails ArticlePubMed
TargetD(2) dopamine receptor(Homo sapiens (Human))
University Of North Carolina At Chapel Hill
Curated by ChEMBL
LigandPNGBDBM50395579(CHEMBL2165136 | UNC10099991 | US9156822, 36)
Affinity DataEC50:  64nMpH: 7.4Assay Description:Recruitment of β-arrestin to agonist-stimulated D2 receptors was performed using a previously described Tango-type assay (Barnea et al., Proc. N...
In DepthDetails US Patent