BDBM50395581 CHEMBL2165134::UNC10000010::US9156822, 28
SMILES Clc1cccc(N2CCN(CCCCOc3ccc4cn[nH]c4c3)CC2)c1Cl
InChI Key InChIKey=IKOXHMZXTCWMQE-UHFFFAOYSA-N
Data  2 KI  4 EC50
  Tab Delimited (TSV)   2D SDfile   Computed 3D by Vconf -m prep SDfile
Find this compound or compounds like it in BindingDB:
Activity Spreadsheet -- Enzyme Inhibition Constant Data from BindingDB
Found 6 hits for monomerid = 50395581
TargetD(2) dopamine receptor(Homo sapiens (Human))
University Of North Carolina At Chapel Hill
Curated by ChEMBL
LigandPNGBDBM50395581(CHEMBL2165134 | UNC10000010 | US9156822, 28)
Affinity DataKi:  66nM. Assay description: Displacement of [3H]N-methylspiperone from human D2L receptor expressed in CHO cells after 1.5 hrs by microbeta counting method
In DepthDetails ArticlePubMed
TargetD(2) dopamine receptor(Homo sapiens (Human))
University Of North Carolina At Chapel Hill
Curated by ChEMBL
LigandPNGBDBM50395581(CHEMBL2165134 | UNC10000010 | US9156822, 28)
Affinity DataKi:  66nMpH: 7.4Assay Description:Membranes prepared as above were resuspended to 1 ug protein/ul (measured by Bradford assay using BSA as standard), and 50 ul were added to each well...
In DepthDetails US Patent
TargetD(2) dopamine receptor(Homo sapiens (Human))
University Of North Carolina At Chapel Hill
Curated by ChEMBL
LigandPNGBDBM50395581(CHEMBL2165134 | UNC10000010 | US9156822, 28)
Affinity DataEC50:  92nMpH: 7.4Assay Description:Recruitment of β-arrestin to agonist-stimulated D2 receptors was performed using a previously described Tango-type assay (Barnea et al., Proc. N...
In DepthDetails US Patent
TargetD(2) dopamine receptor(Homo sapiens (Human))
University Of North Carolina At Chapel Hill
Curated by ChEMBL
LigandPNGBDBM50395581(CHEMBL2165134 | UNC10000010 | US9156822, 28)
Affinity DataEC50:  100nM. Assay description: Partial agonist activity at D2L receptor in human HTLA cells assessed as beta arrestin recruitment at 6 uM after 18 hrs by luminescence assay
In DepthDetails ArticlePubMed
TargetD(2) dopamine receptor(Homo sapiens (Human))
University Of North Carolina At Chapel Hill
Curated by ChEMBL
LigandPNGBDBM50395581(CHEMBL2165134 | UNC10000010 | US9156822, 28)
Affinity DataEC50:  18nM
In DepthDetails US Patent
TargetD(2) dopamine receptor(Homo sapiens (Human))
University Of North Carolina At Chapel Hill
Curated by ChEMBL
LigandPNGBDBM50395581(CHEMBL2165134 | UNC10000010 | US9156822, 28)
Affinity DataEC50:  5.70nMpH: 7.4Assay Description:HEK293T cells co-expressing the cAMP biosensor GloSensor-22F (Promega) and hD2 receptors were seeded (10,000 cells/20 ul/well) into white, clear-bott...
In DepthDetails US Patent