BDBM50396313 CHEMBL2172476
SMILES CC(=O)Nc1cc(nc(C)n1)-c1c(Nc2ccn(C)n2)nc2ccccn12
InChI Key InChIKey=UVYODFKMMWFOEC-UHFFFAOYSA-N
Data  2 IC50
  Tab Delimited (TSV)   2D SDfile   Computed 3D by Vconf -m prep SDfile
Find this compound or compounds like it in BindingDB:
Activity Spreadsheet -- Enzyme Inhibition Constant Data from BindingDB
Found 2 hits for monomerid = 50396313
TargetSerine/threonine-protein kinase mTOR(Homo sapiens (Human))
Amgen
Curated by ChEMBL
LigandPNGBDBM50396313(CHEMBL2172476)
Affinity DataIC50:  67nM. Assay description: Inhibition of mTOR by LanthaScreen assay
In DepthDetails ArticlePubMed
LigandPNGBDBM50396313(CHEMBL2172476)
Affinity DataIC50:  4.58E+3nM. Assay description: Inhibition of PI3Kalpha by AlphaScreen assay
In DepthDetails ArticlePubMed