BDBM50396315 CHEMBL2172474
SMILES CC(=O)Nc1cc(nc(C)n1)-c1c(Nc2ccn(C)n2)nc2cccnn12
InChI Key InChIKey=CWCIJIQAVFNXDY-UHFFFAOYSA-N
Data  2 IC50
  Tab Delimited (TSV)   2D SDfile   Computed 3D by Vconf -m prep SDfile
Find this compound or compounds like it in BindingDB:
Activity Spreadsheet -- Enzyme Inhibition Constant Data from BindingDB
Found 2 hits for monomerid = 50396315
TargetSerine/threonine-protein kinase mTOR(Homo sapiens (Human))
Amgen
Curated by ChEMBL
LigandPNGBDBM50396315(CHEMBL2172474)
Affinity DataIC50:  55nM. Assay description: Inhibition of mTOR by LanthaScreen assay
In DepthDetails ArticlePubMed
LigandPNGBDBM50396315(CHEMBL2172474)
Affinity DataIC50:  1.66E+3nM. Assay description: Inhibition of PI3Kalpha by AlphaScreen assay
In DepthDetails ArticlePubMed