BDBM50396320 CHEMBL2172631
SMILES Cc1nc(Nc2cccnc2)cc(n1)-c1c(Nc2ccn[nH]2)nc2cccnn12
InChI Key InChIKey=MQFYWBFKHIRBIQ-UHFFFAOYSA-N
Data  2 IC50
  Tab Delimited (TSV)   2D SDfile   Computed 3D by Vconf -m prep SDfile
Find this compound or compounds like it in BindingDB:
Activity Spreadsheet -- Enzyme Inhibition Constant Data from BindingDB
Found 2 hits for monomerid = 50396320
TargetSerine/threonine-protein kinase mTOR(Homo sapiens (Human))
Amgen
Curated by ChEMBL
LigandPNGBDBM50396320(CHEMBL2172631)
Affinity DataIC50:  147nM. Assay description: Inhibition of mTOR by LanthaScreen assay
In DepthDetails ArticlePubMed
LigandPNGBDBM50396320(CHEMBL2172631)
Affinity DataIC50:  1.14E+3nM. Assay description: Inhibition of PI3Kalpha by AlphaScreen assay
In DepthDetails ArticlePubMed