BDBM50397209 CHEMBL2172291
SMILES CCN1\C(=C\C=C\C=C\C2=[N+](CC)c3ccc(cc3C2(C)C)S([O-])(=O)=O)C(C)(CCCC(=O)NCCOCCOCCOCCOCCOCCOCCn2cc(CNC(=O)CCC(=O)NC3CCCN(C(=O)c4ccc(NC(=O)c5ccccc5-c5ccccc5)cc4)c4ccccc34)nn2)c2cc(ccc12)S(O)(=O)=O
InChI Key InChIKey=ZFFXISNLLVHKAH-UHFFFAOYSA-N
Data  2 KI  1 Kd
  Tab Delimited (TSV)   2D SDfile   Computed 3D by Vconf -m prep SDfile
Find this compound or compounds like it in BindingDB:
Activity Spreadsheet -- Enzyme Inhibition Constant Data from BindingDB
Found 3 hits for monomerid = 50397209
TargetVasopressin V2 receptor(Homo sapiens (Human))
University Of Strasburg
Curated by ChEMBL
LigandPNGBDBM50397209(CHEMBL2172291)
Affinity DataKi:  0.830nM. Assay description: Displacement of [3H]-AVP from SNAP-tagged vasopressin V2 receptor expressed in HEK293 cells by FRET assay
In DepthDetails ArticlePubMed
TargetVasopressin V2 receptor(Homo sapiens (Human))
University Of Strasburg
Curated by ChEMBL
LigandPNGBDBM50397209(CHEMBL2172291)
Affinity DataKi:  14.2nM. Assay description: Displacement of [3H]-AVP from human vasopressin V2 receptor expressed in CHO cells after 30 mins
In DepthDetails ArticlePubMed
TargetVasopressin V2 receptor(Homo sapiens (Human))
University Of Strasburg
Curated by ChEMBL
LigandPNGBDBM50397209(CHEMBL2172291)
Affinity DataKd:  2.53nM. Assay description: Binding affinity to SNAP-tagged vasopressin V2 receptor expressed in HEK293 cells after 1 hr by TR-FRET assay
In DepthDetails ArticlePubMed