BDBM50397211 CHEMBL2172393
SMILES CCN(CC)c1ccc2c(-c3ccc(cc3S([O-])(=O)=O)S(=O)(=O)NCCOCCOCCOCCC(=O)NC3CCCN(C(=O)c4ccc(NC(=O)c5ccccc5-c5ccccc5)cc4)c4ccccc34)c3ccc(cc3oc2c1)=[N+](CC)CC
InChI Key InChIKey=SDSVZRBQCYMWED-UHFFFAOYSA-N
Data  1 KI
  Tab Delimited (TSV)   2D SDfile   Computed 3D by Vconf -m prep SDfile
Find this compound or compounds like it in BindingDB:
Activity Spreadsheet -- Enzyme Inhibition Constant Data from BindingDB
Found 1 hit for monomerid = 50397211
TargetVasopressin V2 receptor(Homo sapiens (Human))
University Of Strasburg
Curated by ChEMBL
LigandPNGBDBM50397211(CHEMBL2172393)
Affinity DataKi:  16.8nM. Assay description: Displacement of [3H]-AVP from human vasopressin V2 receptor expressed in CHO cells after 30 mins
In DepthDetails ArticlePubMed