BDBM50397264 CHEMBL2169940
SMILES Cc1ccc(cc1)-c1ccc(cc1)[C@@H]1C[C@@H]1c1cc(=O)n(C)c(N)n1
InChI Key InChIKey=FBSQSJNXSBPZNY-ROUUACIJSA-N
Data  1 IC50
  Tab Delimited (TSV)   2D SDfile   Computed 3D by Vconf -m prep SDfile
Find this compound or compounds like it in BindingDB:
Activity Spreadsheet -- Enzyme Inhibition Constant Data from BindingDB
Found 1 hit for monomerid = 50397264
TargetBeta-secretase 1(Homo sapiens (Human))
Shionogi
Curated by ChEMBL
LigandPNGBDBM50397264(CHEMBL2169940)
Affinity DataIC50:  1.19E+5nM. Assay description: Inhibition of human recombinant BACE1 using biotin-XSEVNLDAEFRHDSGC-Eu as substrate after 3 hrs by HTRF assay
In DepthDetails ArticlePubMed