BDBM50397837 CHEMBL2179074
SMILES CCN(CC)CCOc1ccccc1Nc1nc(cc(n1)-c1ccc(Cl)cc1)-c1ccc(Cl)cc1
InChI Key InChIKey=ZNAYQMLUMSHALT-UHFFFAOYSA-N
Data  1 IC50
  Tab Delimited (TSV)   2D SDfile   Computed 3D by Vconf -m prep SDfile
Find this compound or compounds like it in BindingDB:
Activity Spreadsheet -- Enzyme Inhibition Constant Data from BindingDB
Found 1 hit for monomerid = 50397837
TargetAdvanced glycosylation end product-specific receptor(Homo sapiens (Human))
Seoul National University
Curated by ChEMBL
LigandPNGBDBM50397837(CHEMBL2179074)
Affinity DataIC50:  4.60E+3nM. Assay description: Inhibition of human recombinant biotinylated receptor for advanced glycation end product expressed in Escherichia coli DE3 assessed as inhibition of ...
In DepthDetails ArticlePubMed