BDBM50398482 CHEMBL2179142
SMILES NC(=O)c1ccccc1NC(=O)c1ccc(cc1)C(=O)Nc1ccccc1C(N)=O
InChI Key InChIKey=PIDYOOGTVDDMEE-UHFFFAOYSA-N
Data  4 EC50
  Tab Delimited (TSV)   2D SDfile   Computed 3D by Vconf -m prep SDfile
Find this compound or compounds like it in BindingDB:
Activity Spreadsheet -- Enzyme Inhibition Constant Data from BindingDB
Found 4 hits for monomerid = 50398482
TargetProtective antigen(Bacillus anthracis)
National Institute Of Allergy And Infectious Diseases
Curated by ChEMBL
LigandPNGBDBM50398482(CHEMBL2179142)
Affinity DataEC50:  1.00E+3nM. Assay description: Inhibition of matrix metalloprotease activated Bacillus anthracis Protective antigen-mediated cytotoxicity in HT1080 cells compound co-treated for 5 ...
In DepthDetails ArticlePubMed
TargetProtective antigen(Bacillus anthracis)
National Institute Of Allergy And Infectious Diseases
Curated by ChEMBL
LigandPNGBDBM50398482(CHEMBL2179142)
Affinity DataEC50:  3.00E+3nM. Assay description: Inhibition of Bacillus anthracis Protective antigen-mediated cytotoxicity in RAW264.7 cells compound co-treated for 5 hrs with antigen by MTT assay i...
In DepthDetails ArticlePubMed
TargetProtective antigen(Bacillus anthracis)
National Institute Of Allergy And Infectious Diseases
Curated by ChEMBL
LigandPNGBDBM50398482(CHEMBL2179142)
Affinity DataEC50:  1.00E+3nM. Assay description: Inhibition of Bacillus anthracis Protective antigen-mediated cytotoxicity in RAW264.7 cells compound co-treated for 5 hrs with antigen measured after...
In DepthDetails ArticlePubMed
TargetProtective antigen(Bacillus anthracis)
National Institute Of Allergy And Infectious Diseases
Curated by ChEMBL
LigandPNGBDBM50398482(CHEMBL2179142)
Affinity DataEC50:  1.00E+3nM. Assay description: Inhibition of Bacillus anthracis Protective antigen-mediated cytotoxicity in HT1080 cells compound co-treated for 5 hrs with antigen measured after 4...
In DepthDetails ArticlePubMed