BDBM50399552 CHEMBL1651027
SMILES [#6]-[#6@@H](-[#8])-[#6@@H]-1-[#7]-[#6](=O)-[#6@@H]-2-[#6]-[#6@@H](-[#8])-[#6]-[#7]-2-[#6](=O)-[#6@H](-[#6]-[#8])-[#7]-[#6](=O)-[#6@@H]-2-[#6]-[#16]-[#16]-[#6]-[#6@@H]-3-[#7]-[#6](=O)-[#6@H](-[#6]-[#8])-[#7]-[#6](=O)-[#6@H](-[#6]-[#6]-[#6]\[#7]=[#6](/[#7])-[#7])-[#7]-[#6](=O)-[#6@H](-[#6]-[#16]-[#16]-[#6]-[#6@H](-[#7])-[#6](=O)-[#7]-[#6@@H](-[#6]-[#6]-[#6]-[#6]-[#7])-[#6](=O)-[#7]-[#6@@H](-[#6]-[#8])-[#6](=O)-[#7]-4-[#6]-[#6@H](-[#8])-[#6]-[#6@H]-4-[#6](=O)-[#7]-[#6]-[#6](=O)-[#7]-[#6@@H](-[#6]-[#8])-[#6](=O)-[#7]-[#6@@H](-[#6]-[#8])-[#6](=O)-[#7]-2)-[#7]-[#6](=O)-[#6@H](-[#6]-[#16]-[#16]-[#6]-[#6@H](-[#7]-[#6](=O)-[#6@H](-[#6]-[#6]-[#6]\[#7]=[#6](/[#7])-[#7])-[#7]-[#6](=O)-[#6@H](-[#6]-[#6]-[#6]-[#6]-[#7])-[#7]-[#6](=O)-[#6@@H](-[#7]-[#6](=O)-[#6@H](-[#6]-c2ccc(-[#8])cc2)-[#7]-[#6](=O)-[#6@@H]-2-[#6]-[#6@@H](-[#8])-[#6]-[#7]-2-[#6](=O)-[#6@H](-[#6]-[#6](-[#7])=O)-[#7]-[#6]-3=O)-[#6@@H](-[#6])-[#8])-[#6](=O)-[#7]-[#6@@H](-[#6]-c2ccc(-[#8])cc2)-[#6](-[#7])=O)-[#7]-[#6](=O)-[#6@H](-[#6]-[#6](-[#7])=O)-[#7]-[#6](=O)-[#6@H](-[#6]-c2ccc(-[#8])cc2)-[#7]-[#6](=O)-[#6@H](-[#6]-[#8])-[#7]-[#6]-1=O
InChI Key InChIKey=FDQZTPPHJRQRQQ-NZPQQUJLSA-N
Data  2 IC50
  Tab Delimited (TSV)   2D SDfile   Computed 3D by Vconf -m prep SDfile
Find this compound or compounds like it in BindingDB:
Activity Spreadsheet -- Enzyme Inhibition Constant Data from BindingDB
Found 2 hits for monomerid = 50399552
TargetVoltage-dependent N-type calcium channel subunit alpha-1B(Homo sapiens (Human))
Merck Research Laboratories
Curated by ChEMBL
LigandPNGBDBM50399552(CHEMBL1651027)
Affinity DataIC50:  40nM. Assay description: Inhibition of Cav2.2 expressed HEK293 cells assessed as inhibition of calcium flux by FLIPR assay in presence of 30 mM of potassium
In DepthDetails ArticlePubMed
TargetVoltage-dependent N-type calcium channel subunit alpha-1B(Homo sapiens (Human))
Merck Research Laboratories
Curated by ChEMBL
LigandPNGBDBM50399552(CHEMBL1651027)
Affinity DataIC50:  20nM. Assay description: Inhibition of Cav2.2 expressed HEK293 cells assessed as inhibition of calcium flux by FLIPR assay in presence of 4 mM of potassium
In DepthDetails ArticlePubMed