BDBM50399628 CHEMBL2181173
SMILES CCCN1CCC(COc2nc3ccccc3c3cc(F)ccc23)CC1
InChI Key InChIKey=FUAKKVJIUKYDQT-UHFFFAOYSA-N
Data  1 KI
  Tab Delimited (TSV)   2D SDfile   Computed 3D by Vconf -m prep SDfile
Find this compound or compounds like it in BindingDB:
Activity Spreadsheet -- Enzyme Inhibition Constant Data from BindingDB
Found 1 hit for monomerid = 50399628
Target5-hydroxytryptamine receptor 4(GUINEA PIG)
Universit£
Curated by ChEMBL
LigandPNGBDBM50399628(CHEMBL2181173)
Affinity DataKi:  209nM. Assay description: Displacement of [3H]GR113808 from 5HT4R in guinea pig striatal membranes
In DepthDetails ArticlePubMed