BDBM50399813 CHEMBL2179841
SMILES Clc1cccc(c1)C(=O)N[C@@H]1C2CCN(CC2)[C@H]1Cc1cccnc1
InChI Key InChIKey=IPFZKDYPXYBFPN-RBUKOAKNSA-N
Data  2 KI  1 EC50
  Tab Delimited (TSV)   2D SDfile   Computed 3D by Vconf -m prep SDfile
Find this compound or compounds like it in BindingDB:
Activity Spreadsheet -- Enzyme Inhibition Constant Data from BindingDB
Found 3 hits for monomerid = 50399813
TargetNeuronal acetylcholine receptor subunit alpha-7(Homo sapiens (Human))
Targacept
Curated by ChEMBL
LigandPNGBDBM50399813(CHEMBL2179841)
Affinity DataKi:  46nM. Assay description: Displacement of [3H]epibatidine form human alpha7 nAchR expressed in HEK293 cells
In DepthDetails ArticlePubMed
TargetNeuronal acetylcholine receptor subunit alpha-4/beta-2(Homo sapiens (Human))
Targacept
Curated by ChEMBL
LigandPNGBDBM50399813(CHEMBL2179841)
Affinity DataKi:  500nM. Assay description: Displacement of [3H]nicotine human alpha4beta2 nAChR in SH-EP1 cell membranes
In DepthDetails ArticlePubMed
TargetNeuronal acetylcholine receptor subunit alpha-7(Rattus norvegicus (Rat))
Targacept
Curated by ChEMBL
LigandPNGBDBM50399813(CHEMBL2179841)
Affinity DataEC50:  600nM. Assay description: Agonist activity at rat alpha7 nAchR expressed in GH4C1 cells by whole cell patch clamp assay
In DepthDetails ArticlePubMed