BDBM50399835 CHEMBL2180269
SMILES COC(=O)C1=C(C)N=C2CC(CC(=O)C2C1c1ccc(cc1)-c1ccccc1)C(C)C
InChI Key InChIKey=RTIUJDYMWVKLOA-UHFFFAOYSA-N
Data  1 IC50
  Tab Delimited (TSV)   2D SDfile   Computed 3D by Vconf -m prep SDfile
Find this compound or compounds like it in BindingDB:
Activity Spreadsheet -- Enzyme Inhibition Constant Data from BindingDB
Found 1 hit for monomerid = 50399835
TargetTGF-beta receptor type-2(Homo sapiens (Human))
Human Biomolecular Research Institute
Curated by ChEMBL
LigandPNGBDBM50399835(CHEMBL2180269)
Affinity DataIC50:  940nM. Assay description: Inhibition of TGBR2 signaling in human HEK293T cells assessed as inhibition of SMAD activation after 2 to 22 hrs by dual Luciferase Assay
In DepthDetails ArticlePubMed