BDBM50401815 CHEMBL2207590
SMILES O=C(N[C@@H](C1CCCCC1)c1cn(nn1)C1(CC1)C#N)c1ccc(cc1)C#N
InChI Key InChIKey=XYBHHUZMSUXQJS-IBGZPJMESA-N
Data  1 IC50
  Tab Delimited (TSV)   2D SDfile   Computed 3D by Vconf -m prep SDfile
Find this compound or compounds like it in BindingDB:
Activity Spreadsheet -- Enzyme Inhibition Constant Data from BindingDB
Found 1 hit for monomerid = 50401815
TargetCathepsin S(Homo sapiens (Human))
Boehringer Ingelheim Pharmaceuticals
Curated by ChEMBL
LigandPNGBDBM50401815(CHEMBL2207590)
Affinity DataIC50:  2.20nM. Assay description: Inhibition of cathepsin S using FR-aminoluciferin as substrate preincubated for 15 mins before substrate addition measured after 1 hr by luminescence...
In DepthDetails ArticlePubMed