BDBM50402336 CHEMBL2206107
SMILES Cn1c(SCCc2ccc(Cl)cc2)nc2n(C)c(=O)n(C)c(=O)c12
InChI Key InChIKey=LXNLGYHPWSMVIH-UHFFFAOYSA-N
Data  2 KI  2 IC50
  Tab Delimited (TSV)   2D SDfile   Computed 3D by Vconf -m prep SDfile
Find this compound or compounds like it in BindingDB:
Activity Spreadsheet -- Enzyme Inhibition Constant Data from BindingDB
Found 4 hits for monomerid = 50402336
TargetAmine oxidase [flavin-containing] B(Homo sapiens (Human))
North-West University
Curated by ChEMBL
LigandPNGBDBM50402336(CHEMBL2206107)
Affinity DataKi:  9.80nM. Assay description: Competitive inhibition of human recombinant MAO-B expressed in insect cell microsome using kynuramine as substrate by Morrison equation analysis
In DepthDetails ArticlePubMed
TargetAmine oxidase [flavin-containing] B(Homo sapiens (Human))
North-West University
Curated by ChEMBL
LigandPNGBDBM50402336(CHEMBL2206107)
Affinity DataKi:  13nM. Assay description: Competitive inhibition of human recombinant MAO-B expressed in insect cell microsome using kynuramine as substrate by Lineweaver-Burk plot analysis
In DepthDetails ArticlePubMed
TargetAmine oxidase [flavin-containing] A(Homo sapiens (Human))
North-West University
Curated by ChEMBL
LigandPNGBDBM50402336(CHEMBL2206107)
Affinity DataIC50:  8.46E+3nM. Assay description: Inhibition of human recombinant MAO-A expressed in insect cell microsome assessed as 4-hydroxyquinoline formation using kynuramine as substrate after...
In DepthDetails ArticlePubMed
TargetAmine oxidase [flavin-containing] B(Homo sapiens (Human))
North-West University
Curated by ChEMBL
LigandPNGBDBM50402336(CHEMBL2206107)
Affinity DataIC50:  20nM. Assay description: Inhibition of human recombinant MAO-B expressed in insect cell microsome assessed as 4-hydroxyquinoline formation using kynuramine as substrate after...
In DepthDetails ArticlePubMed