BDBM50406087 CHEMBL2111810
SMILES CC(C)CNC(=O)C(=C)C[C@H](O)[C@H](CC1CCCCC1)NC(=O)[C@@H](C)C[C@@H](O)[C@H](Cc1ccccc1)NC(=O)OC(C)(C)C
InChI Key InChIKey=KMIWCPRVDHQNGQ-HEPRJOMSSA-N
Data  1 IC50
  Tab Delimited (TSV)   2D SDfile   Computed 3D by Vconf -m prep SDfile
Find this compound or compounds like it in BindingDB:
Activity Spreadsheet -- Enzyme Inhibition Constant Data from BindingDB
Found 1 hit for monomerid = 50406087
TargetRenin(Homo sapiens (Human))
Abbott Laboratories
Curated by ChEMBL
LigandPNGBDBM50406087(CHEMBL2111810)
Affinity DataIC50:  100nM. Assay description: In vitro inhibitory activity against human renal renin using radioimmuno assay for angiotensin I production
In DepthDetails ArticlePubMed