BDBM50406089 CHEMBL2111809
SMILES CC(C)CNC(=O)C(=C)C[C@H](O)[C@H](CC1CCCCC1)NC(=O)[C@@H](CCCC=C)C[C@@H](O)[C@H](Cc1ccccc1)NC(=O)OC(C)(C)C
InChI Key InChIKey=GNTAPYLRFCZUSK-PRTBYXSSSA-N
Data  1 IC50
  Tab Delimited (TSV)   2D SDfile   Computed 3D by Vconf -m prep SDfile
Find this compound or compounds like it in BindingDB:
Activity Spreadsheet -- Enzyme Inhibition Constant Data from BindingDB
Found 1 hit for monomerid = 50406089
TargetRenin(Homo sapiens (Human))
Abbott Laboratories
Curated by ChEMBL
LigandPNGBDBM50406089(CHEMBL2111809)
Affinity DataIC50:  8nM. Assay description: In vitro inhibitory activity against human renal renin using radioimmuno assay for angiotensin I production
In DepthDetails ArticlePubMed