BDBM50406750 Firazyr::HOE-140::Icatibant
SMILES [H][C@]12C[C@H](N(C(=O)[C@H]3Cc4ccccc4CN3C(=O)[C@H](CO)NC(=O)[C@H](Cc3cccs3)NC(=O)CNC(=O)[C@@H]3C[C@@H](O)CN3C(=O)[C@@H]3CCCN3C(=O)[C@H](CCCNC(N)=N)NC(=O)[C@H](N)CCCNC(N)=N)[C@@]1([H])CCCC2)C(=O)N[C@@H](CCCNC(N)=N)C(O)=O
InChI Key InChIKey=QURWXBZNHXJZBE-SKXRKSCCSA-N
Data  1 KI
  Tab Delimited (TSV)   2D SDfile   Computed 3D by Vconf -m prep SDfile
Find this compound or compounds like it in BindingDB:
Activity Spreadsheet -- Enzyme Inhibition Constant Data from BindingDB
Found 1 hit for monomerid = 50406750
TargetB2 bradykinin receptor(Cavia porcellus)
Scios Nova
Curated by ChEMBL
LigandPNGBDBM50406750(Firazyr | HOE-140 | Icatibant)
Affinity DataKi:  0.110nM. Assay description: In vitro binding affinity against bradykinin receptor B2 from guinea pig ileum.
In DepthDetails ArticlePubMed