BDBM50408025 CHEMBL151179::Ro-20-3053
SMILES CC(=O)c1ccc2NC(=O)CN=C(c3ccccc3F)c2c1
InChI Key InChIKey=YIKGZSNQIIUVSI-UHFFFAOYSA-N
Data  1 IC50
  Tab Delimited (TSV)   2D SDfile   Computed 3D by Vconf -m prep SDfile
Find this compound or compounds like it in BindingDB:
Activity Spreadsheet -- Enzyme Inhibition Constant Data from BindingDB
Found 1 hit for monomerid = 50408025
TargetTranslocator protein(Homo sapiens (Human))
Harvard University
Curated by ChEMBL
LigandPNGBDBM50408025(CHEMBL151179 | Ro-20-3053)
Affinity DataIC50:  5.55E+7nM. Assay description: Binding affinity of compound towards Benzodiazepine receptor in a competition assay
In DepthDetails ArticlePubMed