BDBM50408029 CHEMBL341902::Ro-14-3074
SMILES Fc1ccccc1C1=NCC(=O)Nc2ccc(cc12)N=[N+]=[N-]
InChI Key InChIKey=YRCZCTTYQASZDW-UHFFFAOYSA-N
Data  1 IC50
  Tab Delimited (TSV)   2D SDfile   Computed 3D by Vconf -m prep SDfile
Find this compound or compounds like it in BindingDB:
Activity Spreadsheet -- Enzyme Inhibition Constant Data from BindingDB
Found 1 hit for monomerid = 50408029
TargetTranslocator protein(Homo sapiens (Human))
Harvard University
Curated by ChEMBL
LigandPNGBDBM50408029(CHEMBL341902 | Ro-14-3074)
Affinity DataIC50:  1.88E+8nM. Assay description: Binding affinity of compound towards Benzodiazepine receptor in a competition assay
In DepthDetails ArticlePubMed