BDBM50408131 CHEMBL36426
SMILES CN(Cc1ccc2nc(C)[nH]c(=O)c2c1)c1ccc(C(=O)N[C@@H](CCC(O)=O)C(=O)N(C)[C@@H](CCC(O)=O)C(O)=O)c(F)c1
InChI Key InChIKey=ORFLDLUTSPFRNW-GOTSBHOMSA-N
Data  1 KI
  Tab Delimited (TSV)   2D SDfile   Computed 3D by Vconf -m prep SDfile
Find this compound or compounds like it in BindingDB:
Activity Spreadsheet -- Enzyme Inhibition Constant Data from BindingDB
Found 1 hit for monomerid = 50408131
TargetThymidylate synthase(Mus musculus)
The Institute Of Cancer Research
Curated by ChEMBL
LigandPNGBDBM50408131(CHEMBL36426)
Affinity DataKi:  23nM. Assay description: Inhibition of Thymidylate Synthase(TS) from mouse L1210 cells
In DepthDetails ArticlePubMed