BDBM50408202 CHEMBL92901
SMILES COc1ccccc1N1CCN(CCCNc2nc(C)cc(C)c2C(N)=O)CC1
InChI Key InChIKey=CDERFWONVHXZLJ-UHFFFAOYSA-N
Data  1 KI
  Tab Delimited (TSV)   2D SDfile   Computed 3D by Vconf -m prep SDfile
Find this compound or compounds like it in BindingDB:
Activity Spreadsheet -- Enzyme Inhibition Constant Data from BindingDB
Found 1 hit for monomerid = 50408202
TargetAlpha-1A adrenergic receptor(CALF)
Roche Bioscience
Curated by ChEMBL
LigandPNGBDBM50408202(CHEMBL92901)
Affinity DataKi:  1.60nM. Assay description: In vitro for the displacement of [3H]prazosin binding to bovine Alpha-1A adrenergic receptorChecked by Author
In DepthDetails ArticlePubMed