BDBM50408315 CHEMBL137849
SMILES Clc1ccc2Oc3cc(Cl)c(Cl)cc3Oc2c1Cl
InChI Key InChIKey=YDZCLBKUTXYYKS-UHFFFAOYSA-N
Data  1 EC50
  Tab Delimited (TSV)   2D SDfile   Computed 3D by Vconf -m prep SDfile
Find this compound or compounds like it in BindingDB:
Activity Spreadsheet -- Enzyme Inhibition Constant Data from BindingDB
Found 1 hit for monomerid = 50408315
TargetAryl hydrocarbon receptor(Homo sapiens (Human))
Harvard University
Curated by ChEMBL
LigandPNGBDBM50408315(CHEMBL137849)
Affinity DataEC50:  160nM. Assay description: Affinity on cytosolic Aromatic hydrocarbon receptor (Ah)
In DepthDetails ArticlePubMed