BDBM50410410 CHEMBL2096742::SHU-9119
SMILES CCCC[C@@H](NC(C)=O)C(=O)N[C@@H]1CC(=O)NCCCC[C@H](NC(=O)[C@H](Cc2c[nH]c3ccccc23)NC(=O)[C@H](CCCNC(N)=N)NC(=O)[C@@H](Cc2ccc3ccccc3c2)NC(=O)[C@H](Cc2cnc[nH]2)NC1=O)C(N)=O
InChI Key InChIKey=GGYWLZFXFKFWKL-GLWNXGLNSA-N
Data  2 EC50
  Tab Delimited (TSV)   2D SDfile   Computed 3D by Vconf -m prep SDfile
Find this compound or compounds like it in BindingDB:
Activity Spreadsheet -- Enzyme Inhibition Constant Data from BindingDB
Found 2 hits for monomerid = 50410410
TargetMelanocortin receptor 5(Mus musculus (Mouse))
University Of Florida
Curated by ChEMBL
LigandPNGBDBM50410410(CHEMBL2096742 | SHU-9119)
Affinity DataEC50:  2.31nM. Assay description: Effective concentration for mouse Melanocortin-5 receptor
In DepthDetails ArticlePubMed
TargetMelanocyte-stimulating hormone receptor(Mus musculus)
University Of Florida
Curated by ChEMBL
LigandPNGBDBM50410410(CHEMBL2096742 | SHU-9119)
Affinity DataEC50:  0.640nM. Assay description: Effective concentration for mouse Melanocortin-1 receptor
In DepthDetails ArticlePubMed