BDBM50410579 CHEMBL371771
SMILES O=C(NC1(CCCCC1)C(=O)NCC#N)c1csc(n1)-c1ccncc1
InChI Key InChIKey=OPHPJJNODSFTJR-UHFFFAOYSA-N
Data  1 KI
  Tab Delimited (TSV)   2D SDfile   Computed 3D by Vconf -m prep SDfile
Find this compound or compounds like it in BindingDB:
Activity Spreadsheet -- Enzyme Inhibition Constant Data from BindingDB
Found 1 hit for monomerid = 50410579
TargetCathepsin K(Oryctolagus cuniculus (rabbit))
Celera Genomics
Curated by ChEMBL
LigandPNGBDBM50410579(CHEMBL371771)
Affinity DataKi:  150nM. Assay description: Inhibitory constant against rabbit cathepsin K using Z-Phe-Arg-AMC substrate
In DepthDetails ArticlePubMed