BDBM50410581 CHEMBL199483
SMILES CC(C)(C)[C@H](NC(=O)OCc1ccccc1)C(=O)NCC#N
InChI Key InChIKey=XXWJZGOUHFLGLC-CYBMUJFWSA-N
Data  1 KI
  Tab Delimited (TSV)   2D SDfile   Computed 3D by Vconf -m prep SDfile
Find this compound or compounds like it in BindingDB:
Activity Spreadsheet -- Enzyme Inhibition Constant Data from BindingDB
Found 1 hit for monomerid = 50410581
TargetCathepsin K(Oryctolagus cuniculus (rabbit))
Celera Genomics
Curated by ChEMBL
LigandPNGBDBM50410581(CHEMBL199483)
Affinity DataKi:  1.90E+3nM. Assay description: Inhibitory constant against rabbit cathepsin K using Z-Phe-Arg-AMC substrate
In DepthDetails ArticlePubMed